﻿"Item Id","Item URI","Dublin Core:Title","Dublin Core:Subject","Dublin Core:Description","Dublin Core:Creator","Dublin Core:Source","Dublin Core:Publisher","Dublin Core:Date","Dublin Core:Contributor","Dublin Core:Rights","Dublin Core:Relation","Dublin Core:Format","Dublin Core:Language","Dublin Core:Type","Dublin Core:Identifier","Dublin Core:Coverage","Item Type Metadata:Interviewer","Item Type Metadata:Bibliography","Item Type Metadata:Biographical Text","Item Type Metadata:Occupation","Item Type Metadata:Death Date","Item Type Metadata:Birthplace","Item Type Metadata:Birth Date","Item Type Metadata:Participants","Item Type Metadata:Event Type","Item Type Metadata:URL","Item Type Metadata:Materials","Item Type Metadata:Text","Item Type Metadata:Interviewee","Item Type Metadata:Location","Item Type Metadata:Transcription","Item Type Metadata:Local URL","Item Type Metadata:Original Format","Item Type Metadata:Physical Dimensions","Item Type Metadata:Duration","Item Type Metadata:Compression","Item Type Metadata:Producer","Item Type Metadata:Director","Item Type Metadata:Bit Rate/Frequency","Item Type Metadata:Time Summary","Item Type Metadata:Email Body","Item Type Metadata:Subject Line","Item Type Metadata:From","Item Type Metadata:To","Item Type Metadata:CC","Item Type Metadata:BCC","Item Type Metadata:Number of Attachments","Item Type Metadata:Standards","Item Type Metadata:Objectives","Item Type Metadata:Lesson Plan Text","PDF Text:Text",tags,file,itemType,collection,public,featured
3546,http://repositorio.febab.libertar.org/items/show/3546,"Usuários potenciais: o caso dos operários da UFMG.",,"A partir de uma visão de biblioteconomia enquanto atividade social e das bibliotecas enquanto agentes de mudança, transformações e desenvolvimento das sociedades, foi realizada uma pesquisa com os operários da UFMG, visando identificar a sua familiaridade com canais de comunicação formal e sua percepção sobre bibliotecas. São apresentados os resultados desta pesquisa e recomendações preliminares para implantação de uma biblioteca alternativa para estes usuários.","Pinheiro, Marisa Gurjão^^Lott, Beatriz Marçolla^^Loureiro, Maria Cristina Guimarães^^Christ, Virgínia",,UFRGS,1987,,,,,pt,Evento,,"Porto Alegre (Rio Grande do Sul)",,,,,,,,,,,,,,,,,,,,,,,,,,,,,,,,,,,,snbu1987,http://repositorio.febab.libertar.org/temp/snbu/SNBU1987_032.pdf,Event,"SNBU - Edição: 05 - Ano: 1987 (UFRGS - Porto Alegre/RS)",1,0
3534,http://repositorio.febab.libertar.org/items/show/3534,"Treinamento para auxiliares bolsistas da Biblitoeca central da UFRGS.",,"Experiência da Biblioteca Central no treinamento de auxiliares-bolsistas. Apresenta parte teórica e prática de um plano de treinamento. Infere que o Método de Orientação é o recomendado para essa categoria de auxiliar e apresenta conclusões sobre o plano de ensino.","Oliveira, Beatriz Marona de^^Fernandes, Miriam Velci Barcellos",,UFRGS,1987,,,,,pt,Evento,,"Porto Alegre (Rio Grande do Sul)",,,,,,,,,,,,,,,,,,,,,,,,,,,,,,,,,,,,snbu1987,http://repositorio.febab.libertar.org/temp/snbu/SNBU1987_020.pdf,Event,"SNBU - Edição: 05 - Ano: 1987 (UFRGS - Porto Alegre/RS)",1,0
3552,http://repositorio.febab.libertar.org/items/show/3552,Sumário,,,,,UFRGS,1987,,,,,pt,Evento,,"Porto Alegre (Rio Grande do Sul)",,,,,,,,,,,,,,,,,,,,,,,,,,,,,,,,,,,,snbu1987,http://repositorio.febab.libertar.org/temp/snbu/SNBU1987_038.pdf,Event,"SNBU - Edição: 05 - Ano: 1987 (UFRGS - Porto Alegre/RS)",1,0
3508,http://repositorio.febab.libertar.org/items/show/3508,Sumário,,,,,UFRGS,1987,,,,,pt,Evento,,"Porto Alegre (Rio Grande do Sul)",,,,,,,,,,,,,,,,,,,,,,,,,,,,,,,,,,,,snbu1987,http://repositorio.febab.libertar.org/temp/snbu/SNBU1987_002.pdf,Event,"SNBU - Edição: 05 - Ano: 1987 (UFRGS - Porto Alegre/RS)",1,0
3535,http://repositorio.febab.libertar.org/items/show/3535,"Sistema NIDFURG.",,"Sistema de automação da Fundação Universidade do Rio Grande, funcionando em caráter experimental e sendo desenvolvido independentemente de qualquer outro sistema, no sentido de melhorar a recuperação da informação, preservação do catálogo e utilização apropriada dos recursos humanos.","Meirelles, Lucilena Velleda^^Vallente, José Luiz da Silva",,UFRGS,1987,,,,,pt,Evento,,"Porto Alegre (Rio Grande do Sul)",,,,,,,,,,,,,,,,,,,,,,,,,,,,,,,,,,,,snbu1987,http://repositorio.febab.libertar.org/temp/snbu/SNBU1987_021.pdf,Event,"SNBU - Edição: 05 - Ano: 1987 (UFRGS - Porto Alegre/RS)",1,0
3527,http://repositorio.febab.libertar.org/items/show/3527,"Sistema de Informacion y Documentacion para la Educacion Superior - SIDES.",,"Apresenta a tendência dos serviços de documentação e analisa seus componentes dentro do conceito de uma rede de serviços. Define a organização do SIDES- Sistema de Información y Documentacion para la Educacion Superior.","Ordoñez, José Árias",,UFRGS,1987,,,,,es,Evento,,"Porto Alegre (Rio Grande do Sul)",,,,,,,,,,,,,,,,,,,,,,,,,,,,,,,,,,,,snbu1987,http://repositorio.febab.libertar.org/temp/snbu/SNBU1987_013.pdf,Event,"SNBU - Edição: 05 - Ano: 1987 (UFRGS - Porto Alegre/RS)",1,0
3559,http://repositorio.febab.libertar.org/items/show/3559,"Relatório técnico do 5º SNBU.",,,,,UFRGS,1987,,,,,pt,Evento,,"Porto Alegre (Rio Grande do Sul)",,,,,,,,,,,,,,,,,,,,,,,,,,,,,,,,,,,,snbu1987,http://repositorio.febab.libertar.org/temp/snbu/SNBU1987_045.pdf,Event,"SNBU - Edição: 05 - Ano: 1987 (UFRGS - Porto Alegre/RS)",1,0
3543,http://repositorio.febab.libertar.org/items/show/3543,"Reestruturação do serviço de referência da Biblioteca Central da UFMG: uma experiência.",,"Relata a reestruturação do Serviço de referência da Biblioteca Central da UFMG, a partir de 1983, com a implantação da nova dinâmica. Descreve as mudanças realizadas, a criação de novos serviços e o planejamento para 1987.","Drumond, Vania Regina Peres^^Costa, Tharcilla Martins^^Paniago, Clara de Assis Magalhães",,UFRGS,1987,,,,,pt,Evento,,"Porto Alegre (Rio Grande do Sul)",,,,,,,,,,,,,,,,,,,,,,,,,,,,,,,,,,,,snbu1987,http://repositorio.febab.libertar.org/temp/snbu/SNBU1987_029.pdf,Event,"SNBU - Edição: 05 - Ano: 1987 (UFRGS - Porto Alegre/RS)",1,0
3556,http://repositorio.febab.libertar.org/items/show/3556,"Rede de dados bibliográficos no Brasil: uma necessidade real.",,"As bibliotecas reconhecem que  sózinhas não conseguem atender todas as demandas de seus usuários. Enfatiza os esforços cooperativos visando criar uma rede eletrônica, ligando os acervos das bibliotecas. Analisa também as definições, as funções e os produtos de uma rede. Comenta as ações necessárias  para que o Plano Nacional de Bibliotecas Universitárias-PNBU possa estimular a criação dessa rede.","Cunha, Murilo Bastos da",,UFRGS,1987,,,,,pt,Evento,,"Porto Alegre (Rio Grande do Sul)",,,,,,,,,,,,,,,,,,,,,,,,,,,,,,,,,,,,snbu1987,http://repositorio.febab.libertar.org/temp/snbu/SNBU1987_042.pdf,Event,"SNBU - Edição: 05 - Ano: 1987 (UFRGS - Porto Alegre/RS)",1,0
3555,http://repositorio.febab.libertar.org/items/show/3555,"Rede de Bibliotecas, uma solução para as universidades.",,"Uma visão parcial das bibliotecas universitárias, as premissas necessárias a um processo cooperativo e uma avaliação da biblioteca como sistema. O trabalho analisa o PNBU em relação às colocações acima e faz uma breve avaliação do Sistema CALCO e da Rede Bibliodata, concluindo pela importância da implantação de uma rede de bibliotecas universitárias.","Cysneiros, Luiz Fernando",,UFRGS,1987,,,,,pt,Evento,,"Porto Alegre (Rio Grande do Sul)",,,,,,,,,,,,,,,,,,,,,,,,,,,,,,,,,,,,snbu1987,http://repositorio.febab.libertar.org/temp/snbu/SNBU1987_041.pdf,Event,"SNBU - Edição: 05 - Ano: 1987 (UFRGS - Porto Alegre/RS)",1,0
3526,http://repositorio.febab.libertar.org/items/show/3526,"Red Nacional de Bibliotecas Universitárias, RENBU, una respuesta a la involución bibliotecaria argentina.",,"Expõe em amplas pinceladas a situação bibliotecá argentina depois de reconquistar a democracia. Relata os graves danos sofridos pelas bibliotecas argentinas durante o regime ditatorial, mas expõe as ações que empreenderam para retomar o caminho do desenvolvimento  bibliotecário. Faz uma exposição teórica sober a estrutura da Rede Nacional de Biblitotecas Universitárias - RENBU.","Luvecce, Galo",,UFRGS,1987,,,,,es,Evento,,"Porto Alegre (Rio Grande do Sul)",,,,,,,,,,,,,,,,,,,,,,,,,,,,,,,,,,,,snbu1987,http://repositorio.febab.libertar.org/temp/snbu/SNBU1987_012.pdf,Event,"SNBU - Edição: 05 - Ano: 1987 (UFRGS - Porto Alegre/RS)",1,0
3539,http://repositorio.febab.libertar.org/items/show/3539,"Proposta de política de seleção para a Biblioteca Central da UEMA.",,"Considerações gerais sobre seleção para formação e desenvolvimento da coleção em Bibliotecas Universitárias. Proposta de política de seleção para a Biblioteca Central da Universidade Estadual do Maranhão-UEMA, mediante a identificação de elementos adequados à formação da coleção e descarte de material. Abordagens sobre a importância dos programas cooperativos e quanto ao comportamento diante da censura.","Machado, Iracéli Rodrigues",,UFRGS,1987,,,,,pt,Evento,,"Porto Alegre (Rio Grande do Sul)",,,,,,,,,,,,,,,,,,,,,,,,,,,,,,,,,,,,snbu1987,http://repositorio.febab.libertar.org/temp/snbu/SNBU1987_025.pdf,Event,"SNBU - Edição: 05 - Ano: 1987 (UFRGS - Porto Alegre/RS)",1,0
3531,http://repositorio.febab.libertar.org/items/show/3531,"Programa de Aquisição Planificada de Periódicos na Universidade de São Paulo.",,"Visa racionalizar a aquisição de publicações periódicas na USP, através da implantação de programa cooperativo entre as Unidades de Ensino e Pesquisa, com centralização do processo de pagamento pelo Departamento Técnico do Sistema Integrado de Bibliotecas- SIBI. Apresenta metodologia utilizada e considerações quanto à dificuldades encontradas e vantagens obtidas.","Pasquarelli, Maria Luiza Rigo, Krzyzanwski, Rosaly Favero^^Kuae, Laura Kikue Nasuno",,UFRGS,1987,,,,,pt,Evento,,"Porto Alegre (Rio Grande do Sul)",,,,,,,,,,,,,,,,,,,,,,,,,,,,,,,,,,,,snbu1987,http://repositorio.febab.libertar.org/temp/snbu/SNBU1987_017.pdf,Event,"SNBU - Edição: 05 - Ano: 1987 (UFRGS - Porto Alegre/RS)",1,0
3524,http://repositorio.febab.libertar.org/items/show/3524,"Produção científica cultural das Instituições de Ensino Superior - ""Memória intelectual da Universidade federal de Minas Gerais- UFMG"".",,"A necessidade de preservação da memória intelectual das instituições é essencial para a própria sobrevivência da instituição. Metodologia e procedimentos adotados para implantação do projeto ""Memória Intelectual da UFMG"", com explanação do histórico e razões que levaram ao desenvolvimento do projeto.","Borges, Stella Maris",,UFRGS,1987,,,,,pt,Evento,,"Porto Alegre (Rio Grande do Sul)",,,,,,,,,,,,,,,,,,,,,,,,,,,,,,,,,,,,snbu1987,http://repositorio.febab.libertar.org/temp/snbu/SNBU1987_010.pdf,Event,"SNBU - Edição: 05 - Ano: 1987 (UFRGS - Porto Alegre/RS)",1,0
3553,http://repositorio.febab.libertar.org/items/show/3553,"Plano Nacional de Bibliotecas Universitárias - Discurso MEC/SESu.",,"Discurso do representante do MEC/SESu sobre o Plano Nacional de Bibliotecas Universitárias- PNBU. Menciona que a biblioteca, no contexto acadêmico se constitui não somente em sua mais importante infra-estrutura, como também em um elememento integrador, uma vez que a comunidade universitária é, simultaneamante geradora e transmissora de conhecimento. Foi considerando este aspecto que a SESu tomou a forte decisão de priorizar em sua programação o apoio às bibliotecas.","Galvão. Derblay",,UFRGS,1987,,,,,pt,Evento,,"Porto Alegre (Rio Grande do Sul)",,,,,,,,,,,,,,,,,,,,,,,,,,,,,,,,,,,,snbu1987,http://repositorio.febab.libertar.org/temp/snbu/SNBU1987_039.pdf,Event,"SNBU - Edição: 05 - Ano: 1987 (UFRGS - Porto Alegre/RS)",1,0
3529,http://repositorio.febab.libertar.org/items/show/3529,"Periódicos de Letras: comparação, análise e sugestões.",,"Analise a coleção periódica na área de Letras da UNESP, tendo como base a lista de periódicos cobertos pelo Arts & Humanities Citation Index, 1984. Compara as coleções da UNESP e do Catálogo Coletivo Nacional de Periódicos-CCN. Apresenta estratégias para a coleção e propõe listas para a aquisição de periódicos e obras de referência.","Guarido, Maura Duate Moreira^^Buim, Maria Aparecida Maritan^^Buttarello, Maria José Stefani^^Oliveira, Tereza da Silva Freitas;",,UFRGS,1987,,,,,pt,Evento,,"Porto Alegre (Rio Grande do Sul)",,,,,,,,,,,,,,,,,,,,,,,,,,,,,,,,,,,,snbu1987,http://repositorio.febab.libertar.org/temp/snbu/SNBU1987_015.pdf,Event,"SNBU - Edição: 05 - Ano: 1987 (UFRGS - Porto Alegre/RS)",1,0
3548,http://repositorio.febab.libertar.org/items/show/3548,"Orientação bibliográfica no processo ensino/aprendizado para alunos de graduação - uma experiência didática.",,"Relata a experiência didática vivida mediante a oferta da disciplina de Orientação Bibliográfica para alunos de graduação em Nutrição da Faculdade de Saúde Pública da USP, visando proporcionar aos alunos as habilidades de identificar, acessar , conhecer, sintetizar e aplicar informações extraídas de diferentes fontes bibliográficas. Enfatiza a importância da integração da Biblioteca com o corpo docente no processo de ensino/aprendizagem. Propõe a incorporação do bibliotecário no corpo docente de instituições de ensino superior.","Andrade, Maria Teresinha Dias de^^Szarfarc, Sophia Cornbluth",,UFRGS,1987,,,,,pt,Evento,,"Porto Alegre (Rio Grande do Sul)",,,,,,,,,,,,,,,,,,,,,,,,,,,,,,,,,,,,snbu1987,http://repositorio.febab.libertar.org/temp/snbu/SNBU1987_034.pdf,Event,"SNBU - Edição: 05 - Ano: 1987 (UFRGS - Porto Alegre/RS)",1,0
3554,http://repositorio.febab.libertar.org/items/show/3554,"O impacto da implantação do Programa de Aquisição Planificada de Periódicos para as Bibliotecas Universitárias - PAP.",,"Apresenta o Programa de Aquisição Planificada de Periódicos como estratégia que primeiramente constituir uma rede de aquisição planificada visando racionalizar recursos, entre 19 IES com pós-graduação,  assegurar o compartilhamento através do COMUT e, em segundo,  apoiar as Bibliotecas de 35 instituições com graduação ou com pós-graduação em implantação, na aquisição dos títulos da coleção básica. Relata a experiência de implantação do projeto, a divisão dos títulos em cada região do país e os resultados obtidos.","Chastinet, Yone^^Lima, Ida Maria Cardoso",,UFRGS,1987,,,,,pt,Evento,,"Porto Alegre (Rio Grande do Sul)",,,,,,,,,,,,,,,,,,,,,,,,,,,,,,,,,,,,snbu1987,http://repositorio.febab.libertar.org/temp/snbu/SNBU1987_040.pdf,Event,"SNBU - Edição: 05 - Ano: 1987 (UFRGS - Porto Alegre/RS)",1,0
3525,http://repositorio.febab.libertar.org/items/show/3525,"Networking and cooperation among academic libraries in the United States.",,"Apresenta uma comparação  sobre o engajamento das Bibliotecas Universitárias americanas, mencionando a associação voluntária dos bibliotecários às Associações como ALA. Medical Library Association, American Association of Law Libraries e outras, com as bibliotecas e biblitoecários nop Brasil. Conclui que a principal diferença entre a cooperação entre bibliotecas acadêmicas nos EUA e no Brasil parece ser que seus vizinhos do norte confiaram em esforços voluntários (e às vezes aleatórios), enquanto o Brasil adotou uma abordagem centralizada que parece muito promissora. Os elementos de cooperação estão presentes em ambos os grupos e coincidem quase completamente.","Segal, Jona S",,UFRGS,1987,,,,,en,Evento,,"Porto Alegre (Rio Grande do Sul)",,,,,,,,,,,,,,,,,,,,,,,,,,,,,,,,,,,,snbu1987,http://repositorio.febab.libertar.org/temp/snbu/SNBU1987_011.pdf,Event,"SNBU - Edição: 05 - Ano: 1987 (UFRGS - Porto Alegre/RS)",1,0
3522,http://repositorio.febab.libertar.org/items/show/3522,"Mudando os rumos da participação bibliotecária; uma proposta de curso de especialização de bibliotecários de instituições de ensino superior.",,"Proposta de um curso de especialização para bibliotecários mediante análise do cenário internacional da formação dos profissionais que atuam em bibliotecas universitárias, visando criar um curso  para capacitar melhor os profissoinais de informação de biblitoecas univertsitárias especializadas, contribuindo para mudar a imagem do bibliotecário e seu lugar no processo acadêmico, a partir da atuação consequente, e para torná-lo um agente de mudanças sociais.","Pinheiro, Lena Vania Ribeiro^^Pereira, Maria de Nazaré Freitas",,UFRGS,1987,,,,,pt,Evento,,"Porto Alegre (Rio Grande do Sul)",,,,,,,,,,,,,,,,,,,,,,,,,,,,,,,,,,,,snbu1987,http://repositorio.febab.libertar.org/temp/snbu/SNBU1987_008.pdf,Event,"SNBU - Edição: 05 - Ano: 1987 (UFRGS - Porto Alegre/RS)",1,0
3517,http://repositorio.febab.libertar.org/items/show/3517,"Metodologia para avaliação de coleções de periódicos em bibliotecas universitárias.",,"Descrição de metodologia para identificação de títulos de periódicos que respondem pelo maior uso da coleção. Coleta de dados feita através de empréstimos realizados, cópias fornecidas pelo COMUT e opinião de usuários. Rotina detalhada para a coleta, inclusive com apresentação dos formulários necessários.","Figueiredo, Nice",,UFRGS,1987,,,,,pt,Evento,,"Porto Alegre (Rio Grande do Sul)",,,,,,,,,,,,,,,,,,,,,,,,,,,,,,,,,,,,snbu1987,http://repositorio.febab.libertar.org/temp/snbu/SNBU1987_006.pdf,Event,"SNBU - Edição: 05 - Ano: 1987 (UFRGS - Porto Alegre/RS)",1,0
3541,http://repositorio.febab.libertar.org/items/show/3541,"Marketing em bibliotecas universitárias brasileiras.",,"Apresenta o planejamento e o plano de marketing de forma geral, defendendo sua aplicação em bibliotecas universitárias brasileiras como parte das políticas e diretrizes emanadas do Plano Nacional de Bibliotecas Universitárias (PNBU)","Silveira, Amelia",,UFRGS,1987,,,,,pt,Evento,,"Porto Alegre (Rio Grande do Sul)",,,,,,,,,,,,,,,,,,,,,,,,,,,,,,,,,,,,snbu1987,http://repositorio.febab.libertar.org/temp/snbu/SNBU1987_027.pdf,Event,"SNBU - Edição: 05 - Ano: 1987 (UFRGS - Porto Alegre/RS)",1,0
3562,http://repositorio.febab.libertar.org/items/show/3562,"Índice de Autores e Índice de Assuntos",,,,,UFRGS,1987,,,,,pt,Evento,,"Porto Alegre (Rio Grande do Sul)",,,,,,,,,,,,,,,,,,,,,,,,,,,,,,,,,,,,snbu1987,http://repositorio.febab.libertar.org/temp/snbu/SNBU1987_048.pdf,Event,"SNBU - Edição: 05 - Ano: 1987 (UFRGS - Porto Alegre/RS)",1,0
3549,http://repositorio.febab.libertar.org/items/show/3549,"Índice de Autores",,,,,UFRGS,1987,,,,,pt,Evento,,"Porto Alegre (Rio Grande do Sul)",,,,,,,,,,,,,,,,,,,,,,,,,,,,,,,,,,,,snbu1987,http://repositorio.febab.libertar.org/temp/snbu/SNBU1987_035.pdf,Event,"SNBU - Edição: 05 - Ano: 1987 (UFRGS - Porto Alegre/RS)",1,0
3550,http://repositorio.febab.libertar.org/items/show/3550,"Índice de Assuntos",,,,,UFRGS,1987,,,,,pt,Evento,,"Porto Alegre (Rio Grande do Sul)",,,,,,,,,,,,,,,,,,,,,,,,,,,,,,,,,,,,snbu1987,http://repositorio.febab.libertar.org/temp/snbu/SNBU1987_036.pdf,Event,"SNBU - Edição: 05 - Ano: 1987 (UFRGS - Porto Alegre/RS)",1,0
3530,http://repositorio.febab.libertar.org/items/show/3530,"Importação de Periódicos para a Rede de Bibliotecas da UNESP: experiências e dificuldades.",,"Relata as experiências e dificuldades da UNESP com relação à importação de periódicos através de agentes ou diretamente com os editores. Propõe alterações visando minimizar as dificuldades enfrentadas.","Froner, Maria Luiza fernandes Jardim^^Kirihata, Julia Hisae Tokuno^^Campos, Maria Ligia^^Oliveira, Tereza da Silva Freitas^^Souto, Maria Constância Martinhão",,UFRGS,1987,,,,,pt,Evento,,"Porto Alegre (Rio Grande do Sul)",,,,,,,,,,,,,,,,,,,,,,,,,,,,,,,,,,,,snbu1987,http://repositorio.febab.libertar.org/temp/snbu/SNBU1987_016.pdf,Event,"SNBU - Edição: 05 - Ano: 1987 (UFRGS - Porto Alegre/RS)",1,0
3538,http://repositorio.febab.libertar.org/items/show/3538,"Formulários para coleta de dados (survey) e estudo de uso de bibliotecas universitárias.",,"Apresentação de formulários detalhados para o levantamento de dados (survey) de bibliotecas universitárias, com a caracterização da biblioteca e seus recursos materiais, de coleções, de pessoal, serviços oferecidos, publicações, etc. Anexa-se formulário específico para a coleta de dados referente ao estudo de uso das coleções, com a descrição da rotina respectiva.","Figueiredo, Nice",,UFRGS,1987,,,,,pt,Evento,,"Porto Alegre (Rio Grande do Sul)",,,,,,,,,,,,,,,,,,,,,,,,,,,,,,,,,,,,snbu1987,http://repositorio.febab.libertar.org/temp/snbu/SNBU1987_024.pdf,Event,"SNBU - Edição: 05 - Ano: 1987 (UFRGS - Porto Alegre/RS)",1,0
3547,http://repositorio.febab.libertar.org/items/show/3547,"Empréstimo não oficial entre as bibliotecas universitárias.",,"Consiste numa explanação sobre a UNESP, como se realiza o empréstimo entre sua Rede de Bibliotecas. Ressalta a importância do empréstimo não oficial entre as bibliotecas universitárias, apontando algumas vantagens e desvantagens geradas por este tipo de serviço.","Souto, Maria Constância Martinhão^^Kirihata, Julia Hisae Tokuno^^Froner, Maria Luiza Fernandes Jardim^^Campos, Maria Ligia^^Oliveira, Tereza da Silva Freitas",,UFRGS,1987,,,,,pt,Evento,,"Porto Alegre (Rio Grande do Sul)",,,,,,,,,,,,,,,,,,,,,,,,,,,,,,,,,,,,snbu1987,http://repositorio.febab.libertar.org/temp/snbu/SNBU1987_033.pdf,Event,"SNBU - Edição: 05 - Ano: 1987 (UFRGS - Porto Alegre/RS)",1,0
3540,http://repositorio.febab.libertar.org/items/show/3540,"Divulgação dos serviços bibliotecários em uma biblioteca universitária.",,"Apresenta considerações em torno do desenvolvimento de atividades de divulgação em bibliotecas universitárias, analisando aspectos de organização da divulgação, reflexos da divulgação junto aos usuários e, por fim, propõe uma alternativa de divulgação de bibliotecas universitárias.","Souza, Francisco das Chagas de",,UFRGS,1987,,,,,pt,Evento,,"Porto Alegre (Rio Grande do Sul)",,,,,,,,,,,,,,,,,,,,,,,,,,,,,,,,,,,,snbu1987,http://repositorio.febab.libertar.org/temp/snbu/SNBU1987_026.pdf,Event,"SNBU - Edição: 05 - Ano: 1987 (UFRGS - Porto Alegre/RS)",1,0
3558,http://repositorio.febab.libertar.org/items/show/3558,"Divulgação da produção científica e cultural das instituições de ensino; os casos da Biblioteca Nacional e da Universidade Federal de Minas Gerais.",,"Análise e questionamento dos textos centrais do Painel ""Divulgação da produção científica e cultural das instituições de ensino superior"" integrante da programação do 5º Seminário Nacional de Biblitoecas Universitárias. ","Targino, Maria das Graças",,UFRGS,1987,,,,,pt,Evento,,"Porto Alegre (Rio Grande do Sul)",,,,,,,,,,,,,,,,,,,,,,,,,,,,,,,,,,,,snbu1987,http://repositorio.febab.libertar.org/temp/snbu/SNBU1987_044.pdf,Event,"SNBU - Edição: 05 - Ano: 1987 (UFRGS - Porto Alegre/RS)",1,0
3545,http://repositorio.febab.libertar.org/items/show/3545,"Deficientes físicos e visuais: barreiras na utilização das bibliotecas da Universidade Federal de Minas Gerais.",,"Estudo das barreiras que interferem na utilização das bibliotecas da UFMG pelos deficientes físicos e visuais. Apresentação da metodologia utilizada e de resultados das entrevistas, dos depoimentos e do experimento gravado em vídeo-cassete. Conclusões.","Magalhães, Gilberto da Costa, Silveira, Júlia Gonçallves da^^Bretas, Maria Beatriz Almeida S.^^Silva, Fátima Sério",,UFRGS,1987,,,,,pt,Evento,,"Porto Alegre (Rio Grande do Sul)",,,,,,,,,,,,,,,,,,,,,,,,,,,,,,,,,,,,snbu1987,http://repositorio.febab.libertar.org/temp/snbu/SNBU1987_031.pdf,Event,"SNBU - Edição: 05 - Ano: 1987 (UFRGS - Porto Alegre/RS)",1,0